{"text_format":"1","workbook":"xlsx","n_sheets":13,"sheets":["Cover","National","National Charts","National Charts by Type","Regional","Summary","Regional Charts","Regional Charts by Type","Data for charts","National Charts for Printing","Regional Charts for Printing","Overview","Refs"],"not_rendered":{"charts":22,"images":1,"macros":1,"external_links":0,"defined_names":22,"comments":0,"pivot_tables":0},"unopened":[],"bounds":{"document_bytes":16777216,"sheet_cells":100000,"rows_first":2000,"rows_last":500,"rows_between":2000,"halvings":0,"cell_chars":16384,"cell_head_chars":4096},"cells_cut":0,"cells_raw":0,"read":"whole","date_system":"1900"}

{"sheet":"Cover","index":0,"n_rows":25,"n_cols":1,"rows_kept":25,"cut":false,"hidden":false,"merged":[]}
[]
[]
[]
[]
[]
[]
[]
[]
[]
[]
{"$rows_left_out":16}
{"sheet":"National","index":1,"n_rows":35,"n_cols":11,"rows_kept":35,"cut":false,"hidden":false,"merged":[[6,4,7,4],[6,6,7,6],[6,8,7,8],[6,10,7,10],[31,0,31,3],[21,1,21,2],[23,1,23,2],[25,1,25,2],[9,1,9,2],[11,1,11,2],[13,1,13,2],[15,1,15,2],[17,1,17,2],[19,1,19,2],[27,1,27,2]]}
[]
[null,"Select Region :","East"]
[]
[null,"Select Local Authority :","Huntingdonshire",null,null,"Deprivation Sector 6 :",{"$f":"IF(ISBLANK($C$4),\"\",(VLOOKUP($C$4,Summary!$A$2:'Summary'!$AI$371,35,0)))","v":"Green"},null,null,"Total Population 4 :",{"$f":"IF(ISBLANK($C$4),\"\",(VLOOKUP($C$4,Summary!BH1:BI371,2,0)))","v":173605}]
[]
[null,null,null,null,"Local Authority",null,"Region",null,"Regional L.A. Average",null,"National"]
[null,null,null,null,{"$f":"C4","v":"Huntingdonshire"},null,{"$f":"C2","v":"East"},null,{"$f":"G7","v":"East"},null,"England"]
[]
[]
[null,"Live births 1 & 3 :",null,null,{"$f":"IF(ISBLANK($C$4),\"\",(VLOOKUP($C$4,Summary!$A$2:'Summary'!$AE$371,2,0)))","v":1966},null,{"$f":"IF(ISBLANK($C$2),\"\",(VLOOKUP($C$2,Summary!$A$2:'Summary'!$AE$371,12,0)))","v":71855},null,{"$f":"IF(ISBLANK($C$2),\"\",(VLOOKUP($C$2,Summary!$A$2:'Summary'!$AE$371,19,0)))","v":1528.8297872340424},null,{"$f":"IF(K6=\"National\",Summary!BE6,IF(National!K6=\"National L.A. Average\",Summary!BF6,\"\"))","v":661496}]
{"$rows_left_out":26}
{"sheet":"National Charts","index":2,"n_rows":34,"n_cols":5,"rows_kept":34,"cut":false,"hidden":false,"merged":[]}
[]
[null,null,null,null,{"$f":"\"Cost of Unplanned Pregnancies - \"&National!E7&\" LA & \"&National!I7","v":"Cost of Unplanned Pregnancies - Huntingdonshire LA & East"}]
[]
[]
[]
[]
[]
[]
[]
[]
{"$rows_left_out":25}
{"sheet":"National Charts by Type","index":3,"n_rows":35,"n_cols":5,"rows_kept":35,"cut":false,"hidden":false,"merged":[]}
[]
[null,null,null,null,{"$f":"\"Cost of Unplanned Pregnancies - \"&National!E7&\" LA & \"&National!I7","v":"Cost of Unplanned Pregnancies - Huntingdonshire LA & East"}]
[]
[null,null,"Select chart type :","Estimated unplanned pregnancies"]
[]
[]
[]
[]
[]
[]
{"$rows_left_out":26}
{"sheet":"Regional","index":4,"n_rows":34,"n_cols":11,"rows_kept":34,"cut":false,"hidden":false,"merged":[[20,1,20,2],[22,1,22,2],[24,1,24,2],[30,0,30,3],[8,1,8,2],[10,1,10,2],[12,1,12,2],[14,1,14,2],[16,1,16,2],[18,1,18,2],[26,1,26,2]]}
[]
[null,null,"Compare Costs of Unplanned Pregnancies Across Local Authorities/Regions"]
[]
[null,null,"Select Area Type :",null,"Local Authority"]
[]
[null,null,null,null,{"$f":"E4","v":"Local Authority"},null,{"$f":"\"Select \"&E4","v":"Select Local Authority"},null,{"$f":"\"Select \"&E4","v":"Select Local Authority"},null,{"$f":"\"Select \"&E4","v":"Select Local Authority"}]
[null,null,null,null,{"$f":"IF(E4=\"Local Authority\",National!C4,IF(Regional!E4=\"Region\",National!C2,\" \"))","v":"Huntingdonshire"},null,"Tameside",null,"Salford",null,"Aylesbury Vale"]
[]
[null,"Live births 1 & 3 :",null,null,{"$f":"IF(E4=\"Local Authority\",National!E10,IF(Regional!E4=\"Region\",National!G10,\" \"))","v":1966},null,{"$f":"IF(ISBLANK($G$7),\"\",(VLOOKUP($G$7,Summary!$A$2:'Summary'!$AE$371,2,0)))","v":2975},null,{"$f":"IF(ISBLANK($I$7),\"\",(VLOOKUP($I$7,Summary!$A$2:'Summary'!$AE$371,2,0)))","v":3512},null,{"$f":"IF(ISBLANK($K$7),\"\",(VLOOKUP($K$7,Summary!$A$2:'Summary'!$AE$371,2,0)))","v":2207}]
[]
{"$rows_left_out":25}
{"sheet":"Summary","index":5,"n_rows":371,"n_cols":61,"rows_kept":371,"cut":false,"hidden":true,"merged":[]}
["Area of usual residence","Live births","Unplanned pregnancies resulting in live births","Estimated expenditure on education associated with live births from unintended pregnancies (minimum)","Estimated expenditure on housing associated with live births from unintended pregnancies (minimum)","Estimated expenditure on personal social services associated with live births from unintended pregnancies (minimum)","Estimated expenditure on social welfare associated with live births from unintended pregnancies (minimum)","Total public sector expenditure","Estimated overall public expenditure associated with live births from unintended pregnancies per capita","Region","Estimated overall public expenditure on education associated with live births from unintended pregnancies (regional)","Regional Live births","Regional Unplanned pregnancies resulting in live births","Regional Estimated expenditure on education associated with live births from unintended pregnancies (minimum)","Regional Estimated expenditure on housing associated with live births from unintended pregnancies (minimum)","Regional Estimated expenditure on personal social services associated with live births from unintended pregnancies (minimum)","Regional Estimated expenditure on social welfare associated with live births from unintended pregnancies (minimum)","Regional total public sector expenditure","Regional Live births (average)","Regional Unplanned pregnancies resulting in live births (average)","Regional Average Estimated expenditure on education associated with live births from unintended pregnancies (minimum)","Regional Average Estimated expenditure on housing associated with live births from unintended pregnancies (minimum)","Regional Average Estimated expenditure on personal social services associated with live births from unintended pregnancies (minimum)","Regional Average Estimated expenditure on social welfare associated with live births from unintended pregnancies (minimum)","Regional total public sector expenditure (average)","Additional cost associated with 5% increase in unplanned pregnancies resulting in live births","Additional cost with 10% increase","(Regional) Additional cost associated with 5% increase in unplanned pregnancies resulting in live births","(Regional) Additional cost with 10% increase","Regional average additional cost associated with 5% increase","Regional average additional cost associated with 10% increase","Regional average of cost/capita","IMD - Average rank","IMD - Rank of average rank","IMD - Rank of average rank - Colour",null,"Local Authority","Region",null,null,null,"Area of usual residence","Region",null,null,null,null,null,null,null,null,"Local Authority","Local Authority District name (2013)",null,null,null,null,null,null,"Area of usual residence","Estimated Population mid-2014"]
["Adur",692,39,57153.961560000003,13708.367760000001,6478.6770000000006,45491.159639999998,{"$f":"SUM(D2:G2)","v":122832.16596},1.9442852659237686,"South East",2.0499999999999998,102406,5837,8457960.3865799997,2028640.3306800001,958750.57349999994,6732034.2400199994,18177385.530779999,1528.4477611940299,87.104477611940297,126238.21472507462,30278.213890746261,14309.710052238808,100478.12298537313,271304.2616534328,6141.6082980000065,12283.216595999998,908869.27653900161,1817738.5530780032,13565.213082671631,27130.42616534332,null,15648.1,150,"Amber",null,"Adur","East","Local Authority","LA",null,"Babergh","East","East","East",null,"Area of usual residence","A",1,null,null,"Adur","Adur",null,null,"National",null,null,null,"Adur",63176]
["Allerdale",902,51,74498.371859999999,17868.421560000003,8444.7494999999999,59296.280339999998,{"$f":"SUM(D3:G3)","v":160107.82326},1.6596471816400784,"North West",2.13,85606,4880,7070407.5625800006,1695836.0266800001,801464.77350000001,5627624.58402,15195332.94678,2195.0256410256411,125.15384615384616,181292.50160461539,43482.975043076913,20550.378807692301,144298.06625692308,389623.92171230767,8005.391162999993,16010.782326000015,759766.6473390013,1519533.2946780007,19481.196085615375,38962.392171230807,null,17703.95,114,"Amber",null,"Allerdale","East Midlands","Region","Region",null,"Basildon","East","East Midlands","EastMidlands",null,"Live births","B",2,null,null,"Allerdale","Allerdale",null,null,"National L.A. Average",null,null,null,"Allerdale",96471]
["Amber Valley",1248,71,103075.35264,24722.605439999999,11684.088,82041.860159999997,221523.90623999998,1.7873191189427311,"East Midlands",2.04,53170,3031,4391439.5031000003,1053286.0026,497790.83250000002,3495325.0839,9437841.4221000001,1329.25,75.8,109785.98757750001,26332.150065000002,12444.770812500003,87383.127097500008,235946.03555249999,11076.195311999996,22152.390624000021,471892.07110499963,943784.14221000113,11797.30177762502,23594.603555250011,null,15071.99,162,"Amber",null,"Amber Valley","London",null,null,null,"Bedford UA ","East","London","London",null,"Unplanned pregnancies resulting in live births","C",3,null,null,"Amber Valley","Amber Valley",null,null,null,null,null,null,"Amber Valley",123942]
["Arun",1463,83,120832.72509000001,28981.708140000002,13696.971750000001,96175.674209999997,259687.07919000002,1.6817586435815406,"South East",2.0499999999999998,102406,5837,8457960.3865799997,2028640.3306800001,958750.57349999994,6732034.2400199994,18177385.530779999,1528.4477611940299,87.104477611940297,126238.21472507462,30278.213890746261,14309.710052238808,100478.12298537313,271304.2616534328,12984.353959500033,25968.707919000008,908869.27653900161,1817738.5530780032,13565.213082671631,27130.42616534332,null,14648.58,174,"Amber",null,"Arun","North East","Select",{"$f":"Regional!E4","v":"Local Authority"},null,"Braintree","East","North East","NorthEast",null,"Total (per annum) education expenditure","D",4,null,null,"Arun","Arun",null,null,null,"National","National Average",null,"Arun",154414]
["Ashfield",1449,83,119676.43107000001,28704.371220000005,13565.900250000001,95255.332829999999,257202.03537000003,2.0994713436673527,"East Midlands",2.04,53170,3031,4391439.5031000003,1053286.0026,497790.83250000002,3495325.0839,9437841.4221000001,1329.25,75.8,109785.98757750001,26332.150065000002,12444.770812500003,87383.127097500008,235946.03555249999,12860.101768500026,25720.203537000023,471892.07110499963,943784.14221000113,11797.30177762502,23594.603555250011,null,19912.580000000002,70,"Red",null,"Ashfield","North West","List",{"$f":"VLOOKUP(AN5,AM2:AN3,2,)","v":"LA"},null,"Breckland","East","North West","NorthWest",null,"Total housing expenditure","E",5,null,null,"Ashfield","Ashfield",null,null,"Live births :",661496,2035,{"$f":"BF6*325","v":661375},"Ashfield",122508]
["Ashford",1474,84,121741.24182,29199.615720000002,13799.9565,96898.799579999992,261639.61361999999,2.1222339588757757,"South East",2.0499999999999998,102406,5837,8457960.3865799997,2028640.3306800001,958750.57349999994,6732034.2400199994,18177385.530779999,1528.4477611940299,87.104477611940297,126238.21472507462,30278.213890746261,14309.710052238808,100478.12298537313,271304.2616534328,13081.980681000015,26163.961362000002,908869.27653900161,1817738.5530780032,13565.213082671631,27130.42616534332,null,14683.06,173,"Amber",null,"Ashford","South East",null,null,null,"Brentwood","East","South East","SouthEast",null,"Total personal social services","F",6,null,null,"Ashford","Ashford",null,null,"Estimated number of unplanned pregnancies resulting in live births :",37705,116,{"$f":"BF7*325","v":37700},"Ashford",123285]
["Aylesbury Vale",2207,126,182281.49301000001,43720.184460000004,20662.48575,145085.24468999999,391749.40790999995,2.1226127433355004,"South East",2.0499999999999998,102406,5837,8457960.3865799997,2028640.3306800001,958750.57349999994,6732034.2400199994,18177385.530779999,1528.4477611940299,87.104477611940297,126238.21472507462,30278.213890746261,14309.710052238808,100478.12298537313,271304.2616534328,19587.470395500015,39174.94079100003,908869.27653900161,1817738.5530780032,13565.213082671631,27130.42616534332,null,9072.8799999999992,283,"Green",null,"Aylesbury Vale","South West","=INDIRECT(List)",null,null,"Broadland","East","South West","SouthWest",null,"Total social welfare expenditure","G",7,null,null,"Aylesbury Vale","Aylesbury Vale",null,null,"Total education cost :",54634562,168106,54634450,"Aylesbury Vale",184560]
["Babergh",756,43,62439.877079999998,14976.19368,7077.8609999999999,49698.434519999995,134192.36628000002,1.5104098855309811,"East",2.12,71855,4096,5934679.0576499999,1423431.7419,672724.47375,4723652.1328499997,12754487.406149998,1528.8297872340424,87.127659574468083,126269.76718404253,30285.781742553198,14313.286675531912,100503.23686914892,271372.07247127662,6709.6183140000212,13419.236628000013,637724.37030750141,1275448.7406150009,13568.603623563831,27137.207247127662,null,13145.45,200,"Amber",null,"Babergh","West Midlands",null,null,null,"Broxbourne","East","West Midlands","WestMidlands",null,"Total public sector expenditure","H",8,null,null,"Babergh","Babergh",null,null,"Total housing cost :",13104090,40320,13104000,"Babergh",88845]
["Barking and Dagenham",3569,203,294772.38267000002,70701.104820000008,33413.87025,234621.31323,633508.67096999998,3.1947949558231716,"London",2.65,127399,7262,10522192.989570001,2523746.1622200003,1192741.2877500001,8375040.8193300003,22613721.258870002,3860.5757575757575,220,318854.3330172727,76477.156430909105,36143.675386363633,253789.11573727272,685264.28057181847,31675.433548500063,63350.867097000009,1130686.0629434995,2261372.1258870028,34263.214028590941,68526.428057181882,null,26045.93,3,"Red",null,"Barking and Dagenham","Yorkshire and the Humber",null,null,null,"Cambridge","East","Yorkshire and the Humber","Yorkshire",null,"Total cost per capita","I",9,null,null,"Barking and Dagenham","Barking and Dagenham",null,null,"Total personal social services cost :",6193091,19056,6193200,"Barking and Dagenham",198294]
{"$rows_left_out":362}
{"sheet":"Regional Charts","index":6,"n_rows":31,"n_cols":5,"rows_kept":31,"cut":false,"hidden":false,"merged":[]}
[]
[null,null,null,null,"Cost of Unplanned Pregnancies - Comparison Across Selected Local Authorities"]
[]
[]
[]
[]
[]
[]
[]
[]
{"$rows_left_out":22}
{"sheet":"Regional Charts by Type","index":7,"n_rows":34,"n_cols":4,"rows_kept":34,"cut":false,"hidden":false,"merged":[]}
[]
[null,null,null,"Cost of Unplanned Pregnancies - Comparison Across Selected Local Authorities"]
[]
[null,"Select chart type :","Total education cost"]
[]
[]
[]
[]
[]
[]
{"$rows_left_out":25}
{"sheet":"Data for charts","index":8,"n_rows":81,"n_cols":12,"rows_kept":81,"cut":false,"hidden":true,"merged":[]}
[]
[]
[null,"National"]
[]
[null,null,{"$f":"National!E7","v":"Huntingdonshire"},{"$f":"National!I7","v":"East"}]
[null,"Live births",{"$f":"National!E10","v":1966},{"$f":"National!I10","v":1528.8297872340424}]
[]
[null,null,{"$f":"C5","v":"Huntingdonshire"},{"$f":"D5","v":"East"},null,null,null,{"$f":"C5","v":"Huntingdonshire"},{"$f":"D5","v":"East"}]
[null,"Estimated number of unplanned pregnancies resulting in live births",{"$f":"National!E12","v":112},{"$f":"National!I12","v":87.127659574468083},null,null,"Live births",{"$f":"National!E10","v":1966},{"$f":"National!I10","v":1528.8297872340424}]
[null,null,null,null,null,null,"Estimated unplanned pregnancies",{"$f":"National!E12","v":112},{"$f":"National!I12","v":87.127659574468083}]
{"$rows_left_out":72}
{"sheet":"National Charts for Printing","index":9,"n_rows":67,"n_cols":5,"rows_kept":67,"cut":false,"hidden":true,"merged":[]}
[]
[null,null,null,null,{"$f":"\"Cost of Unintended Pregnancies - \"&National!E7&\" LA & \"&National!I7","v":"Cost of Unintended Pregnancies - Huntingdonshire LA & East"}]
[]
[]
[]
[]
[]
[]
[]
[]
{"$rows_left_out":58}
{"sheet":"Regional Charts for Printing","index":10,"n_rows":66,"n_cols":6,"rows_kept":66,"cut":false,"hidden":true,"merged":[]}
[]
[null,null,null,null,null,"Cost of Unintended Pregnancy - Comparison Across Selected Local Authorities"]
[]
[]
[]
[]
[]
[]
[]
[]
{"$rows_left_out":57}
{"sheet":"Overview","index":11,"n_rows":27,"n_cols":3,"rows_kept":27,"cut":false,"hidden":false,"merged":[]}
[]
[]
[]
[]
[]
[]
[null,null,{"$f":"\"For \"&National!E7&\" the estimated number of unplanned pregnancies resulting in live births is \"&National!E12&\" per annum\"","v":"For Huntingdonshire the estimated number of unplanned pregnancies resulting in live births is 112 per annum"}]
[]
[]
[null,null,{"$f":"\"The total public sector cost of these unplanned pregnancies in \"&National!E7&\" is \"&TEXT(National!E22,\"£#,000,000\")&\" per annum\"","v":"The total public sector cost of these unplanned pregnancies in Huntingdonshire is £348,971 per annum"}]
{"$rows_left_out":18}
{"sheet":"Refs","index":12,"n_rows":17,"n_cols":6,"rows_kept":17,"cut":false,"hidden":false,"merged":[]}
[]
[]
[]
[null,null,null,"References"]
[]
[]
[null,null,null,1,":","Wellings K et al, 'The prevalence of unplanned pregnancy and associated factors in Britain: findings from the third National Survey of Sexual Attitudes and Lifestyles (Natsal-3), Lancet 2013: 382: 1807-16. Available here: http://www.thelancet.com/journals/lancet/article/PIIS0140-6736(13)62071-1/fulltext"]
[null,null,null,2,":","FPA, Unprotected Nation 2015: An Update on the Financial and Economic Impacts of Restricted Contraceptive and Sexual Health Services, November 2015. Available here: http://www.fpa.org.uk/sites/default/files/unprotected-nation-sexual-health-full-report.pdf"]
[null,null,null,3,":","ONS, Birth Summary Tables, England and Wales 2014, released 15 July 2015 (latest). Available here: http://www.ons.gov.uk/ons/publications/re-reference-tables.html?edition=tcm%3A77-370345"]
[null,null,null,4,":","ONS, Population Estimate, mid-2014. Available here: http://www.ons.gov.uk/ons/rel/pop-estimate/population-estimates-for-uk--england-and-wales--scotland-and-northern-ireland/mid-2014/stb---mid-2014-uk-population-estimates.html"]
{"$rows_left_out":7}